Reaction Details
TargetAcetyl-CoA carboxylase 1
LigandBDBM50439637
Substrate/Competitorn/a
Meas. Tech.ChEMBL_978106 (CHEMBL2422748)
IC50 19±n/a nM
Citation Griffith, DADow, RLHuard, KEdmonds, DJBagley, SWPolivkova, JZeng, DGarcia-Irizarry, CNSouthers, JAEsler, WAmor, PLoomis, KMcPherson, KBahnck, KBPréville, CBanks, TMoore, DEMathiowetz, AMMenhaji-Klotz, ESmith, ACDoran, SDBeebe, DADunn, MF Spirolactam-based acetyl-CoA carboxylase inhibitors: toward improved metabolic stability of a chromanone lead structure. J Med Chem56:7110-9 (2013) 
 
Acetyl-CoA carboxylase 1
Name:Acetyl-CoA carboxylase 1
Type:Protein
Mol. Mass.:265543.22
Organism:Homo sapiens (Human)
Description:Q13085
Residue:2346
BDBM50439637
NameBDBM50439637
Synonyms:CHEMBL2419601
TypeSmall organic molecule
Emp. Form.C22H25N5O3
Mol. Mass.407.4656
SMILESCC(C)(C)n1cc2OC3(CCN(CC3)C(=O)c3ccc4[nH]ncc4c3)CC(=O)c2n1