Reaction Details
TargetAcetyl-CoA carboxylase 2
LigandBDBM50439644
Substrate/Competitorn/a
Meas. Tech.ChEMBL_978105 (CHEMBL2422747)
IC50 3.0±n/a nM
Citation Griffith, DADow, RLHuard, KEdmonds, DJBagley, SWPolivkova, JZeng, DGarcia-Irizarry, CNSouthers, JAEsler, WAmor, PLoomis, KMcPherson, KBahnck, KBPréville, CBanks, TMoore, DEMathiowetz, AMMenhaji-Klotz, ESmith, ACDoran, SDBeebe, DADunn, MF Spirolactam-based acetyl-CoA carboxylase inhibitors: toward improved metabolic stability of a chromanone lead structure. J Med Chem56:7110-9 (2013) 
 
Acetyl-CoA carboxylase 2
Name:Acetyl-CoA carboxylase 2
Type:Protein
Mol. Mass.:276535.21
Organism:Homo sapiens (Human)
Description:O00763
Residue:2458
BDBM50439644
NameBDBM50439644
Synonyms:CHEMBL2419593 | US8993586, 86
TypeSmall organic molecule
Emp. Form.C23H26ClN5O2
Mol. Mass.439.938
SMILESCC(C)(C)n1cc2CC3(CCN(CC3)C(=O)c3ccc4c(Cl)c[nH]c4c3)NC(=O)c2n1