Reaction Details
TargetSphingosine 1-phosphate receptor 3
LigandBDBM50034635
Substrate/Competitorn/a
Meas. Tech.ChEMBL_1439470 (CHEMBL3381247)
EC50<31623±n/a nM
Citation Skidmore, JHeer, JJohnson, CNNorton, DRedshaw, SSweeting, JHurst, DCridland, AVesey, DWall, IAhmed, MRivers, DMyatt, JGiblin, GPhilpott, KKumar, UStevens, ABit, RAHaynes, ATaylor, SWatson, RWitherington, JDemont, EHeightman, TD Optimization of sphingosine-1-phosphate-1 receptor agonists: effects of acidic, basic, and zwitterionic chemotypes on pharmacokinetic and pharmacodynamic profiles. J Med Chem57:10424-42 (2014) 
 
Sphingosine 1-phosphate receptor 3
Name:Sphingosine 1-phosphate receptor 3
Type:G Protein-Coupled Receptor (GPCR)
Mol. Mass.:42278.13
Organism:Homo sapiens (Human)
Description:Q99500
Residue:378
BDBM50034635
NameBDBM50034635
Synonyms:CHEMBL3360361
TypeSmall organic molecule
Emp. Form.C19H18ClN3O2
Mol. Mass.355.818
SMILESCC(C)Oc1ccc(cc1Cl)-c1nc(no1)-c1cccc2CNCc12