Reaction Details
TargetSphingosine 1-phosphate receptor 1
LigandBDBM50034559
Substrate/Competitorn/a
Meas. Tech.ChEMBL_1439469 (CHEMBL3381246)
EC50 5.0±n/a nM
Citation Skidmore, JHeer, JJohnson, CNNorton, DRedshaw, SSweeting, JHurst, DCridland, AVesey, DWall, IAhmed, MRivers, DMyatt, JGiblin, GPhilpott, KKumar, UStevens, ABit, RAHaynes, ATaylor, SWatson, RWitherington, JDemont, EHeightman, TD Optimization of sphingosine-1-phosphate-1 receptor agonists: effects of acidic, basic, and zwitterionic chemotypes on pharmacokinetic and pharmacodynamic profiles. J Med Chem57:10424-42 (2014) 
 
Sphingosine 1-phosphate receptor 1
Name:Sphingosine 1-phosphate receptor 1
Type:Enzyme
Mol. Mass.:42836.02
Organism:Homo sapiens (Human)
Description:P21453
Residue:382
BDBM50034559
NameBDBM50034559
Synonyms:CHEMBL3359852
TypeSmall organic molecule
Emp. Form.C23H24ClN3O5
Mol. Mass.457.907
SMILESCC(C)Oc1ccc(cc1Cl)-c1nc(no1)-c1cccc2C(CCC(O)=O)NCCOc12