Reaction Details
TargetCytochrome P450 11B1, mitochondrial
LigandBDBM50092190
Substrate/Competitorn/a
Meas. Tech.ChEMBL_1498858 (CHEMBL3583832)
IC50 18±n/a nM
Citation Hoyt, SBPark, MKLondon, CXiong, YTata, JBennett, DJCooke, ACai, JCarswell, ERobinson, JMacLean, JBrown, LBelshaw, SClarkson, TRLiu, KLiang, GBStruthers, MCully, DWisniewski, TRen, NBopp, CSok, ACai, TQStribling, SPai, LYMa, XMetzger, JVerras, AMcMasters, DChen, QTung, ETang, WSalituro, GBuist, NKuethe, JRivera, NClemas, JZhou, GGibson, JMaxwell, CALassman, MMcLaughlin, TCastro-Perez, JSzeto, DForrest, GHajdu, RRosenbach, MAli, A Discovery of Benzimidazole CYP11B2 Inhibitors with in Vivo Activity in Rhesus Monkeys. ACS Med Chem Lett6:573-8 (2015) 
 
Cytochrome P450 11B1, mitochondrial
Name:Cytochrome P450 11B1, mitochondrial
Type:Enzyme
Mol. Mass.:57591.44
Organism:Homo sapiens (Human)
Description:P15538
Residue:503
BDBM50092190
NameBDBM50092190
Synonyms:CHEMBL3582482
TypeSmall organic molecule
Emp. Form.C17H15F2N3
Mol. Mass.299.3179
SMILESCc1cncc(-c2nc3cc(F)c(F)cc3n2C2CC2)c1C