Reaction Details
TargetCytochrome P450 11B2, mitochondrial
LigandBDBM50092181
Substrate/Competitorn/a
Meas. Tech.ChEMBL_1498857 (CHEMBL3583831)
IC50 2.1±n/a nM
Citation Hoyt, SBPark, MKLondon, CXiong, YTata, JBennett, DJCooke, ACai, JCarswell, ERobinson, JMacLean, JBrown, LBelshaw, SClarkson, TRLiu, KLiang, GBStruthers, MCully, DWisniewski, TRen, NBopp, CSok, ACai, TQStribling, SPai, LYMa, XMetzger, JVerras, AMcMasters, DChen, QTung, ETang, WSalituro, GBuist, NKuethe, JRivera, NClemas, JZhou, GGibson, JMaxwell, CALassman, MMcLaughlin, TCastro-Perez, JSzeto, DForrest, GHajdu, RRosenbach, MAli, A Discovery of Benzimidazole CYP11B2 Inhibitors with in Vivo Activity in Rhesus Monkeys. ACS Med Chem Lett6:573-8 (2015) 
 
Cytochrome P450 11B2, mitochondrial
Name:Cytochrome P450 11B2, mitochondrial
Type:Protein
Mol. Mass.:57582.15
Organism:Homo sapiens (Human)
Description:P19099
Residue:503
BDBM50092181
NameBDBM50092181
Synonyms:CHEMBL3582469
TypeSmall organic molecule
Emp. Form.C15H11F2N3
Mol. Mass.271.2647
SMILESFc1cc2nc(-c3cccnc3)n(C3CC3)c2cc1F