Reaction Details
TargetALK tyrosine kinase receptor
LigandBDBM50113508
Substrate/Competitorn/a
Meas. Tech.ChEMBL_1510512 (CHEMBL3607640)
IC50 2.0±n/a nM
Citation Zhang, PDong, JZhong, BZhang, DJin, CMeng, XSun, DXu, XZhou, YLiang, ZJi, MLi, HXu, TSong, GZhang, LChen, GYuan, HShih, JZhang, RHou, GJin, YYang, Q Discovery of 2-arylamino-4-(1-methyl-3-isopropylsulfonyl-4-pyrazol-amino)pyrimidines as potent anaplastic lymphoma kinase (ALK) inhibitors. Bioorg Med Chem Lett25:3738-43 (2015) 
 
ALK tyrosine kinase receptor
Name:ALK tyrosine kinase receptor
Type:Protein
Mol. Mass.:176453.10
Organism:Homo sapiens (Human)
Description:Q9UM73
Residue:1620
BDBM50113508
NameBDBM50113508
Synonyms:CHEMBL3604649
TypeSmall organic molecule
Emp. Form.C29H40ClN7O3S
Mol. Mass.602.191
SMILESCC(C)N1CCC(CC1)c1cc(OC2CC2)c(Nc2ncc(Cl)c(Nc3cn(C)nc3S(=O)(=O)C(C)C)n2)cc1C