Reaction Details
TargetALK tyrosine kinase receptor
LigandBDBM50113626
Substrate/Competitorn/a
Meas. Tech.ChEMBL_1510512 (CHEMBL3607640)
IC50 2.0±n/a nM
Citation Zhang, PDong, JZhong, BZhang, DJin, CMeng, XSun, DXu, XZhou, YLiang, ZJi, MLi, HXu, TSong, GZhang, LChen, GYuan, HShih, JZhang, RHou, GJin, YYang, Q Discovery of 2-arylamino-4-(1-methyl-3-isopropylsulfonyl-4-pyrazol-amino)pyrimidines as potent anaplastic lymphoma kinase (ALK) inhibitors. Bioorg Med Chem Lett25:3738-43 (2015) 
 
ALK tyrosine kinase receptor
Name:ALK tyrosine kinase receptor
Type:Protein
Mol. Mass.:176453.10
Organism:Homo sapiens (Human)
Description:Q9UM73
Residue:1620
BDBM50113626
NameBDBM50113626
Synonyms:CHEMBL3604634
TypeSmall organic molecule
Emp. Form.C27H36ClN7O3S
Mol. Mass.574.138
SMILESCC(C)S(=O)(=O)c1nn(C)cc1Nc1nc(Nc2cc(C)c(cc2OC2CC2)C2CCN(C)CC2)ncc1Cl