Reaction Details
TargetALK tyrosine kinase receptor
LigandBDBM50113518
Substrate/Competitorn/a
Meas. Tech.ChEMBL_1510512 (CHEMBL3607640)
IC50 2.0±n/a nM
Citation Zhang, PDong, JZhong, BZhang, DJin, CMeng, XSun, DXu, XZhou, YLiang, ZJi, MLi, HXu, TSong, GZhang, LChen, GYuan, HShih, JZhang, RHou, GJin, YYang, Q Discovery of 2-arylamino-4-(1-methyl-3-isopropylsulfonyl-4-pyrazol-amino)pyrimidines as potent anaplastic lymphoma kinase (ALK) inhibitors. Bioorg Med Chem Lett25:3738-43 (2015) 
 
ALK tyrosine kinase receptor
Name:ALK tyrosine kinase receptor
Type:Protein
Mol. Mass.:176453.10
Organism:Homo sapiens (Human)
Description:Q9UM73
Residue:1620
BDBM50113518
NameBDBM50113518
Synonyms:CHEMBL3604646
TypeSmall organic molecule
Emp. Form.C25H34ClN7O3S
Mol. Mass.548.101
SMILESCC(C)Oc1cc(C2CN(C)C2)c(C)cc1Nc1ncc(Cl)c(Nc2cn(C)nc2S(=O)(=O)C(C)C)n1