Reaction Details
TargetTyrosine-protein kinase JAK3
LigandBDBM50122322
Substrate/Competitorn/a
Meas. Tech.ChEMBL_1518840 (CHEMBL3625646)
IC50 3800±n/a nM
Citation Wan, HSchroeder, GMHart, ACInghrim, JGrebinski, JTokarski, JSLorenzi, MVYou, DMcdevitt, TPenhallow, BVuppugalla, RZhang, YGu, XIyer, RLombardo, LJTrainor, GLRuepp, SLippy, JBlat, YSack, JSKhan, JAStefanski, KSleczka, BMathur, ASun, JHWong, MKWu, DRLi, PGupta, AArunachalam, PNPragalathan, BNarayanan, SK C, NKuppusamy, PPurandare, AV Discovery of a Highly Selective JAK2 Inhibitor, BMS-911543, for the Treatment of Myeloproliferative Neoplasms. ACS Med Chem Lett6:850-5 (2015) 
 
Tyrosine-protein kinase JAK3
Name:Tyrosine-protein kinase JAK3
Type:Protein
Mol. Mass.:125111.08
Organism:Homo sapiens (Human)
Description:P52333
Residue:1124
BDBM50122322
NameBDBM50122322
Synonyms:CHEMBL3622147
TypeSmall organic molecule
Emp. Form.C22H27N9O
Mol. Mass.433.5095
SMILESCCn1c(cc2c1nc(Nc1nc(C)n(C)n1)c1ncn(C)c21)C(=O)N(C1CC1)C1CC1