Reaction Details
TargetALK tyrosine kinase receptor
LigandBDBM50159541
Substrate/Competitorn/a
Meas. Tech.ChEMBL_1568745 (CHEMBL3791910)
IC50 2±n/a nM
Citation Zhang, PDong, JZhong, BZhang, DYuan, HJin, CXu, XLi, HZhou, YLiang, ZJi, MXu, TSong, GZhang, LChen, GMeng, XSun, DShih, JZhang, RHou, GWang, CJin, YYang, Q Design and synthesis of novel 3-sulfonylpyrazol-4-amino pyrimidines as potent anaplastic lymphoma kinase (ALK) inhibitors. Bioorg Med Chem Lett26:1910-8 (2016) 
 
ALK tyrosine kinase receptor
Name:ALK tyrosine kinase receptor
Type:Protein
Mol. Mass.:176453.10
Organism:Homo sapiens (Human)
Description:Q9UM73
Residue:1620
BDBM50159541
NameBDBM50159541
Synonyms:CHEMBL3785890
TypeSmall organic molecule
Emp. Form.C28H36N8O3S
Mol. Mass.564.702
SMILESCC(C)S(=O)(=O)c1nn(C)cc1Nc1nc(Nc2cc(C)c(cc2OC2CC2)C2CCN(C)CC2)ncc1C#N