Reaction Details
TargetALK tyrosine kinase receptor
LigandBDBM50159514
Substrate/Competitorn/a
Meas. Tech.ChEMBL_1568745 (CHEMBL3791910)
IC50 3±n/a nM
Citation Zhang, PDong, JZhong, BZhang, DYuan, HJin, CXu, XLi, HZhou, YLiang, ZJi, MXu, TSong, GZhang, LChen, GMeng, XSun, DShih, JZhang, RHou, GWang, CJin, YYang, Q Design and synthesis of novel 3-sulfonylpyrazol-4-amino pyrimidines as potent anaplastic lymphoma kinase (ALK) inhibitors. Bioorg Med Chem Lett26:1910-8 (2016) 
 
ALK tyrosine kinase receptor
Name:ALK tyrosine kinase receptor
Type:Protein
Mol. Mass.:176453.10
Organism:Homo sapiens (Human)
Description:Q9UM73
Residue:1620
BDBM50159514
NameBDBM50159514
Synonyms:CHEMBL3785607
TypeSmall organic molecule
Emp. Form.C26H33ClN6O5S2
Mol. Mass.609.16
SMILESCC(C)S(=O)(=O)c1nn(C)cc1Nc1nc(Nc2cc(C)c(cc2OC2CC2)C2CCS(=O)(=O)CC2)ncc1Cl