Reaction Details
TargetALK tyrosine kinase receptor
LigandBDBM50113509
Substrate/Competitorn/a
Meas. Tech.ChEMBL_1568745 (CHEMBL3791910)
IC50 6±n/a nM
Citation Zhang, PDong, JZhong, BZhang, DYuan, HJin, CXu, XLi, HZhou, YLiang, ZJi, MXu, TSong, GZhang, LChen, GMeng, XSun, DShih, JZhang, RHou, GWang, CJin, YYang, Q Design and synthesis of novel 3-sulfonylpyrazol-4-amino pyrimidines as potent anaplastic lymphoma kinase (ALK) inhibitors. Bioorg Med Chem Lett26:1910-8 (2016) 
 
ALK tyrosine kinase receptor
Name:ALK tyrosine kinase receptor
Type:Protein
Mol. Mass.:176453.10
Organism:Homo sapiens (Human)
Description:Q9UM73
Residue:1620
BDBM50113509
NameBDBM50113509
Synonyms:CHEMBL3604631
TypeSmall organic molecule
Emp. Form.C26H36ClN7O3S
Mol. Mass.562.127
SMILESCC(C)Oc1cc(C2CCNCC2)c(C)cc1Nc1ncc(Cl)c(Nc2cn(C)nc2S(=O)(=O)C(C)C)n1