Reaction Details
TargetALK tyrosine kinase receptor
LigandBDBM50159517
Substrate/Competitorn/a
Meas. Tech.ChEMBL_1568746 (CHEMBL3791911)
IC50 9±n/a nM
Citation Zhang, PDong, JZhong, BZhang, DYuan, HJin, CXu, XLi, HZhou, YLiang, ZJi, MXu, TSong, GZhang, LChen, GMeng, XSun, DShih, JZhang, RHou, GWang, CJin, YYang, Q Design and synthesis of novel 3-sulfonylpyrazol-4-amino pyrimidines as potent anaplastic lymphoma kinase (ALK) inhibitors. Bioorg Med Chem Lett26:1910-8 (2016) 
 
ALK tyrosine kinase receptor
Name:ALK tyrosine kinase receptor
Type:Protein
Mol. Mass.:176453.10
Organism:Homo sapiens (Human)
Description:Q9UM73
Residue:1620
BDBM50159517
NameBDBM50159517
Synonyms:CHEMBL3785928
TypeSmall organic molecule
Emp. Form.C30H42ClN7O3S
Mol. Mass.616.218
SMILESCC(C)N[C@H]1CC[C@@H](CC1)c1cc(OC2CC2)c(Nc2ncc(Cl)c(Nc3cn(C)nc3S(=O)(=O)C(C)C)n2)cc1C