Reaction Details
TargetEpidermal growth factor receptor
LigandBDBM4779
Substrate/Competitorn/a
Meas. Tech.ChEMBL_1566932 (CHEMBL3790712)
Ki 0.110000±n/a nM
Citation Cheng, HNair, SKMurray, BWAlmaden, CBailey, SBaxi, SBehenna, DCho-Schultz, SDalvie, DDinh, DMEdwards, MPFeng, JLFerre, RAGajiwala, KSHemkens, MDJackson-Fisher, AJalaie, MJohnson, TOKania, RSKephart, SLafontaine, JLunney, BLiu, KKLiu, ZMatthews, JNagata, ANiessen, SOrnelas, MAOrr, STPairish, MPlanken, SRen, SRichter, DRyan, KSach, NShen, HSmeal, TSolowiej, JSutton, STran, KTseng, EVernier, WWalls, MWang, SWeinrich, SLXin, SXu, HYin, MJZientek, MZhou, RKath, JC Discovery of 1-{(3R,4R)-3-[({5-Chloro-2-[(1-methyl-1H-pyrazol-4-yl)amino]-7H-pyrrolo[2,3-d]pyrimidin-4-yl}oxy)methyl]-4-methoxypyrrolidin-1-yl}prop-2-en-1-one (PF-06459988), a Potent, WT Sparing, Irreversible Inhibitor of T790M-Containing EGFR Mutants. J Med Chem59:2005-24 (2016) 
 
Epidermal growth factor receptor
Name:Epidermal growth factor receptor
Synonyms:Epidermal growth factor receptor/Receptor tyrosine-protein kinase erbB-2/Receptor tyrosine-protein kinase erbB-3/Receptor tyrosine-protein kinase erbB-4
Type:n/a
Mol. Mass.:n/a
Description:ASSAY_ID of ChEMBL is 2209351
Components:This complex has 4 components.
Component 1
Name:Receptor tyrosine-protein kinase erbB-2
Type:n/a
Mol. Mass.:137894.47
Organism:Homo sapiens (Human)
Description:P04626
Residue:1255
Component 2
Name:Epidermal growth factor receptor
Synonyms:EGF Receptor Substrate EGFR_HUMAN ERBB1 Epidermal Growth Factor Receptor erbB-1 Epidermal growth factor receptor (EGFR) HER1 Proto-oncogene c-ErbB-1 Tyrosine-Protein Kinase ErbB-1
Type:Receptor Kinase Domain
Mol. Mass.:134279.59
Organism:Homo sapiens (Human)
Description:P00533
Residue:1210
Component 3
Name:Receptor tyrosine-protein kinase erbB-4
Synonyms:ERBB4 Epidermal growth factor receptor ErbB-4 (HER4) Tyrosine Kinase Proto-oncogene c-ErbB-4 Receptor protein-tyrosine kinase erbB-4 Tyrosine kinase-type cell surface receptor HER4 (HER4)
Type:Protein
Mol. Mass.:146803.56
Organism:Homo sapiens (Human)
Description:Q15303
Residue:1308
Component 4
Name:Receptor tyrosine-protein kinase erbB-3
Synonyms:ERBB3 HER3 Tyrosine kinase-type cell surface receptor HER3
Type:PROTEIN
Mol. Mass.:148097.73
Organism:Homo sapiens (Human)
Description:ChEMBL_774331
Residue:1342
BDBM4779
NameBDBM4779
Synonyms:CHEMBL31965 CI-1033 N-{4-[(3-chloro-4-fluorophenyl)amino]-7-[3-(morpholin-4-yl)propoxy]quinazolin-6-yl}prop-2-enamide US10507209, Compound CI-1033 cid_156414
TypeSmall organic molecule
Emp. Form.C24H25ClFN5O3
Mol. Mass.485.938
SMILESFc1ccc(Nc2ncnc3cc(OCCCN4CCOCC4)c(NC(=O)C=C)cc23)cc1Cl