Reaction Details
TargetTyrosine-protein kinase BTK
LigandBDBM230101
Substrate/Competitorn/a
Meas. Tech.ChEMBL_1616836 (CHEMBL3858905)
IC50 1.5±n/a nM
Citation Watterson, SHDe Lucca, GVShi, QLangevine, CMLiu, QBatt, DGBeaudoin Bertrand, MGong, HDai, JYip, SLi, PSun, DWu, DRWang, CZhang, YTraeger, SCPattoli, MASkala, SCheng, LObermeier, MTVickery, RDiscenza, LND'Arienzo, CJZhang, YHeimrich, EGillooly, KMTaylor, TLPulicicchio, CMcIntyre, KWGalella, MATebben, AJMuckelbauer, JKChang, CRampulla, RMathur, ASalter-Cid, LBarrish, JCCarter, PHFura, ABurke, JRTino, JA Discovery of 6-Fluoro-5-(R)-(3-(S)-(8-fluoro-1-methyl-2,4-dioxo-1,2-dihydroquinazolin-3(4H)-yl)-2-methylphenyl)-2-(S)-(2-hydroxypropan-2-yl)-2,3,4,9-tetrahydro-1H-carbazole-8-carboxamide (BMS-986142): A Reversible Inhibitor of Bruton's Tyrosine Kinase (BTK) Conformationally Constrained by Two Locke J Med Chem59:9173-9200 (2016) 
 
Tyrosine-protein kinase BTK
Name:Tyrosine-protein kinase BTK
Type:Enzyme
Mol. Mass.:76289.95
Organism:Homo sapiens (Human)
Description:Q06187
Residue:659
BDBM230101
NameBDBM230101
Synonyms:US10106559, Example 58 US9334290, 25 US9850258, Example 58
TypeSmall organic molecule
Emp. Form.C32H30ClFN4O4
Mol. Mass.589.056
SMILESCc1c(cccc1-n1c(=O)n(C)c2c(F)cccc2c1=O)-c1c(Cl)cc(C(N)=O)c2[nH]c3C[C@H](CCc3c12)C(C)(C)O