Reaction Details
TargetLysophospholipase-like protein 1
LigandBDBM195580
Substrate/Competitorn/a
Meas. Tech.Gel-based ABPP (LYPLAL1)
pH7.5±n/a
IC50 6±n/a nM
Commentsextracted
Citation Ahn, KBoehm, MBrown, MFCalloway, JChe, YChen, JFennell, KFGeoghegan, KFGilbert, AMGutierrez, JAKalgutkar, ASLanba, ALimberakis, CMagee, TVO'Doherty, IOliver, RPabst, BPandit, JParris, KPfefferkorn, JARolph, TPPatel, RSchuff, BShanmugasundaram, VStarr, JTVarghese, AHVera, NBVernochet, CYan, J Discovery of a Selective Covalent Inhibitor of Lysophospholipase-like 1 (LYPLAL1) as a Tool to Evaluate the Role of this Serine Hydrolase in Metabolism. ACS Chem Biol11:2529-40 (2016) 
 
Lysophospholipase-like protein 1
Name:Lysophospholipase-like protein 1
Type:Protein
Mol. Mass.:26322.18
Organism:Homo sapiens (Human)
Description:n/a
Residue:237
BDBM195580
NameBDBM195580
Synonyms:(2R,3R)-1-(3-(4-(2-morpholinopyrimidin-5-yl)phenyl)-1H-1,2,4-triazole-1-carbonyl)-2-phenylpiperidine-3-carboxylic acid (11)
TypeSmall organic molecule
Emp. Form.C29H29N7O4
Mol. Mass.539.5851
SMILESOC(=O)[C@@H]1CCCN([C@H]1c1ccccc1)C(=O)n1cnc(n1)-c1ccc(cc1)-c1cnc(nc1)N1CCOCC1