Reaction Details
TargetLiver carboxylesterase 1
LigandBDBM195573
Substrate/Competitorn/a
Meas. Tech.Gel-based ABPP (CES1)
pH7.5±n/a
IC50 7±n/a nM
Commentsextracted
Citation Ahn, KBoehm, MBrown, MFCalloway, JChe, YChen, JFennell, KFGeoghegan, KFGilbert, AMGutierrez, JAKalgutkar, ASLanba, ALimberakis, CMagee, TVO'Doherty, IOliver, RPabst, BPandit, JParris, KPfefferkorn, JARolph, TPPatel, RSchuff, BShanmugasundaram, VStarr, JTVarghese, AHVera, NBVernochet, CYan, J Discovery of a Selective Covalent Inhibitor of Lysophospholipase-like 1 (LYPLAL1) as a Tool to Evaluate the Role of this Serine Hydrolase in Metabolism. ACS Chem Biol11:2529-40 (2016) 
 
Liver carboxylesterase 1
Name:Liver carboxylesterase 1
Type:Protein
Mol. Mass.:62520.83
Organism:Homo sapiens (Human)
Description:n/a
Residue:567
BDBM195573
NameBDBM195573
Synonyms:(R)-4'-(1-(2-phenylpiperidine-1-carbonyl)-1H-1,2,4-triazol-3-yl)-[1,1'-biphenyl]-4-sulfonamide (4)
TypeSmall organic molecule
Emp. Form.C28H29N5O3S
Mol. Mass.515.627
SMILESCN(C)S(=O)(=O)c1ccc(cc1)-c1ccc(cc1)-c1ncn(n1)C(=O)N1CCCC[C@@H]1c1ccccc1