Reaction Details
TargetGlucocorticoid receptor
LigandBDBM19225
Substrate/CompetitorBDBM18207
Meas. Tech.GR Binding Assay and Human IL-6 Assay
pH7.5±n/a
Temperature277.15±n/a K
IC50 2.1±n/a nM
EC50 5±n/a nM
Citation Thompson, CFQuraishi, NAli, AMosley, RTTata, JRHammond, MLBalkovec, JMEinstein, MGe, LHarris, GKelly, TMMazur, PPandit, SSantoro, JSitlani, AWang, CWilliamson, JMiller, DKYamin, TTThompson, CMO'Neill, EAZaller, DForrest, MJCarballo-Jane, ELuell, S Novel glucocorticoids containing a 6,5-bicyclic core fused to a pyrazole ring: synthesis, in vitro profile, molecular modeling studies, and in vivo experiments. Bioorg Med Chem Lett17:3354-61 (2007) 
 
Glucocorticoid receptor
Name:Glucocorticoid receptor
Type:Enzyme
Mol. Mass.:85656.87
Organism:Homo sapiens (Human)
Description:P04150
Residue:777
BDBM19225
BDBM18207
NameBDBM19225
Synonyms:(R)-[(4aR,5S)-1-(4-fluorophenyl)-4a-methyl-1H,4H,4aH,5H,6H,7H-cyclopenta[f]indazol-5-yl](1-benzothiophen-3-yl)methanol | cyclopenta[f]indazole, 18
TypeSmall organic molecule
Emp. Form.C26H23FN2OS
Mol. Mass.430.537
SMILES[H][C@@]1(CCC2=Cc3c(C[C@]12C)cnn3-c1ccc(F)cc1)[C@@H](O)c1csc2ccccc12