Reaction Details
TargetHistone deacetylase 1
LigandBDBM50314628
Substrate/Competitorn/a
Meas. Tech.ChEMBL_625334 (CHEMBL1111708)
IC50 2.8±n/a nM
Citation Cho, YSWhitehead, LLi, JChen, CHJiang, LVögtle, MFrancotte, ERichert, PWagner, TTraebert, MLu, QCao, XDumotier, BFejzo, JRajan, SWang, PYan-Neale, YShao, WAtadja, PShultz, M Conformational refinement of hydroxamate-based histone deacetylase inhibitors and exploration of 3-piperidin-3-ylindole analogues of dacinostat (LAQ824). J Med Chem53:2952-63 (2010) 
 
Histone deacetylase 1
Name:Histone deacetylase 1
Type:Enzyme
Mol. Mass.:55090.27
Organism:Homo sapiens (Human)
Description:Q13547
Residue:482
BDBM50314628
NameBDBM50314628
Synonyms:(E)-N-Hydroxy-3-{4-[3-(2-methyl-1H-indol-3-yl)pyrrolidin-1-ylmethyl]phenyl}acrylamide | CHEMBL1089344
TypeSmall organic molecule
Emp. Form.C23H25N3O2
Mol. Mass.375.4635
SMILESCc1[nH]c2ccccc2c1C1CCN(Cc2ccc(\C=C\C(=O)NO)cc2)C1