Reaction Details
TargetHistone deacetylase 1
LigandBDBM50314635
Substrate/Competitorn/a
Meas. Tech.ChEMBL_625334 (CHEMBL1111708)
IC50 11±n/a nM
Citation Cho, YSWhitehead, LLi, JChen, CHJiang, LVögtle, MFrancotte, ERichert, PWagner, TTraebert, MLu, QCao, XDumotier, BFejzo, JRajan, SWang, PYan-Neale, YShao, WAtadja, PShultz, M Conformational refinement of hydroxamate-based histone deacetylase inhibitors and exploration of 3-piperidin-3-ylindole analogues of dacinostat (LAQ824). J Med Chem53:2952-63 (2010) 
 
Histone deacetylase 1
Name:Histone deacetylase 1
Type:Enzyme
Mol. Mass.:55090.27
Organism:Homo sapiens (Human)
Description:Q13547
Residue:482
BDBM50314635
NameBDBM50314635
Synonyms:(E)-N-Hydroxy-3-{4-[3-(1H-indol-3-yl)piperidin-1-ylmethyl]-phenyl}acrylamide | CHEMBL1094040
TypeSmall organic molecule
Emp. Form.C23H25N3O2
Mol. Mass.375.4635
SMILESONC(=O)\C=C\c1ccc(CN2CCCC(C2)c2c[nH]c3ccccc23)cc1