Reaction Details
TargetHistone deacetylase 1
LigandBDBM50314636
Substrate/Competitorn/a
Meas. Tech.ChEMBL_625334 (CHEMBL1111708)
IC50 11±n/a nM
Citation Cho, YSWhitehead, LLi, JChen, CHJiang, LVögtle, MFrancotte, ERichert, PWagner, TTraebert, MLu, QCao, XDumotier, BFejzo, JRajan, SWang, PYan-Neale, YShao, WAtadja, PShultz, M Conformational refinement of hydroxamate-based histone deacetylase inhibitors and exploration of 3-piperidin-3-ylindole analogues of dacinostat (LAQ824). J Med Chem53:2952-63 (2010) 
 
Histone deacetylase 1
Name:Histone deacetylase 1
Type:Enzyme
Mol. Mass.:55090.27
Organism:Homo sapiens (Human)
Description:Q13547
Residue:482
BDBM50314636
NameBDBM50314636
Synonyms:(E)-N-Hydroxy-3-{4-[3-(2-phenyl-1H-indol-3-yl)piperidin-1-ylmethyl]phenyl}acrylamide | CHEMBL1094041
TypeSmall organic molecule
Emp. Form.C29H29N3O2
Mol. Mass.451.5595
SMILESONC(=O)\C=C\c1ccc(CN2CCCC(C2)c2c([nH]c3ccccc23)-c2ccccc2)cc1