Reaction Details
TargetVasoactive intestinal polypeptide receptor 1
LigandBDBM50366004
Substrate/Competitorn/a
Meas. Tech.ChEMBL_807309 (CHEMBL1960402)
IC50 3800±n/a nM
Citation Harikrishnan, LSSrivastava, NKayser, LENirschl, DSKumaragurubaran, KRoy, AGupta, AKarmakar, SKaratt, TMathur, ABurford, NTChen, JKong, YCvijic, MCooper, CBPoss, MATrainor, GLWong, TW Identification and optimization of small molecule antagonists of vasoactive intestinal peptide receptor-1 (VIPR1). Bioorg Med Chem Lett22:2287-90 (2012) 
 
Vasoactive intestinal polypeptide receptor 1
Name:Vasoactive intestinal polypeptide receptor 1
Type:PROTEIN
Mol. Mass.:52068.73
Organism:Rattus norvegicus
Description:ChEMBL_807309
Residue:459
BDBM50366004
NameBDBM50366004
Synonyms:CHEMBL1956441
TypeSmall organic molecule
Emp. Form.C19H18N2O2S
Mol. Mass.338.423
SMILESO=C(CC1Cc2ccccc2O1)Nc1sc2CCCCc2c1C#N