Reaction Details
TargetVasoactive intestinal polypeptide receptor 1
LigandBDBM50366005
Substrate/Competitorn/a
Meas. Tech.ChEMBL_807309 (CHEMBL1960402)
IC50 50000±n/a nM
Citation Harikrishnan, LSSrivastava, NKayser, LENirschl, DSKumaragurubaran, KRoy, AGupta, AKarmakar, SKaratt, TMathur, ABurford, NTChen, JKong, YCvijic, MCooper, CBPoss, MATrainor, GLWong, TW Identification and optimization of small molecule antagonists of vasoactive intestinal peptide receptor-1 (VIPR1). Bioorg Med Chem Lett22:2287-90 (2012) 
 
Vasoactive intestinal polypeptide receptor 1
Name:Vasoactive intestinal polypeptide receptor 1
Type:PROTEIN
Mol. Mass.:52068.73
Organism:Rattus norvegicus
Description:ChEMBL_807309
Residue:459
BDBM50366005
NameBDBM50366005
Synonyms:CHEMBL1956442
TypeSmall organic molecule
Emp. Form.C19H17N3OS
Mol. Mass.335.423
SMILESO=C(Cc1cc2ccccc2[nH]1)Nc1sc2CCCCc2c1C#N