Reaction Details
TargetPotassium voltage-gated channel subfamily H member 2
LigandBDBM50350818
Substrate/Competitorn/a
Meas. Tech.ChEMBL_763307 (CHEMBL1820401)
IC50 8480±n/a nM
Citation Shultz, MDCao, XChen, CHCho, YSDavis, NREckman, JFan, JFekete, AFirestone, BFlynn, JGreen, JGrowney, JDHolmqvist, MHsu, MJansson, DJiang, LKwon, PLiu, GLombardo, FLu, QMajumdar, DMeta, CPerez, LPu, MRamsey, TRemiszewski, SSkolnik, STraebert, MUrban, LUttamsingh, VWang, PWhitebread, SWhitehead, LYan-Neale, YYao, YMZhou, LAtadja, P Optimization of the in vitro cardiac safety of hydroxamate-based histone deacetylase inhibitors. J Med Chem54:4752-72 (2011) 
 
Potassium voltage-gated channel subfamily H member 2
Name:Potassium voltage-gated channel subfamily H member 2
Type:Multi-pass membrane protein
Mol. Mass.:126672.65
Organism:Homo sapiens (Human)
Description:Q12809
Residue:1159
BDBM50350818
NameBDBM50350818
Synonyms:CHEMBL1819257
TypeSmall organic molecule
Emp. Form.C26H26N4O3
Mol. Mass.442.5096
SMILESCOc1ccncc1-c1[nH]c2ccccc2c1CCNCc1ccc(\C=C\C(=O)NO)cc1