Reaction Details
TargetTyrosine-protein kinase SYK
LigandBDBM50075734
Substrate/Competitorn/a
Meas. Tech.ChEMBL_1473534 (CHEMBL3420413)
IC50 19±n/a nM
Citation Ellis, JMAltman, MDBass, AButcher, JWByford, AJDonofrio, AGalloway, SHaidle, AMJewell, JKelly, NLeccese, EKLee, SMaddess, MMiller, JRMoy, LYOsimboni, EOtte, RDReddy, MVSpencer, KSun, BVincent, SHWard, GJWoo, GHYang, CHoushyar, HNorthrup, AB Overcoming mutagenicity and ion channel activity: optimization of selective spleen tyrosine kinase inhibitors. J Med Chem58:1929-39 (2015) 
 
Tyrosine-protein kinase SYK
Name:Tyrosine-protein kinase SYK
Type:Enzyme
Mol. Mass.:72079.99
Organism:Homo sapiens (Human)
Description:P43405
Residue:635
BDBM50075734
NameBDBM50075734
Synonyms:CHEMBL3415582
TypeSmall organic molecule
Emp. Form.C19H26N6O
Mol. Mass.354.4493
SMILESCc1cc(C)nc(Nc2cc(N[C@@H]3CCCC[C@@H]3N)ncc2C(N)=O)c1