Reaction Details
TargetTyrosine-protein kinase SYK
LigandBDBM50075814
Substrate/Competitorn/a
Meas. Tech.ChEMBL_1473534 (CHEMBL3420413)
IC50 51±n/a nM
Citation Ellis, JMAltman, MDBass, AButcher, JWByford, AJDonofrio, AGalloway, SHaidle, AMJewell, JKelly, NLeccese, EKLee, SMaddess, MMiller, JRMoy, LYOsimboni, EOtte, RDReddy, MVSpencer, KSun, BVincent, SHWard, GJWoo, GHYang, CHoushyar, HNorthrup, AB Overcoming mutagenicity and ion channel activity: optimization of selective spleen tyrosine kinase inhibitors. J Med Chem58:1929-39 (2015) 
 
Tyrosine-protein kinase SYK
Name:Tyrosine-protein kinase SYK
Type:Enzyme
Mol. Mass.:72079.99
Organism:Homo sapiens (Human)
Description:P43405
Residue:635
BDBM50075814
NameBDBM50075814
Synonyms:CHEMBL3415602
TypeSmall organic molecule
Emp. Form.C18H21N7O
Mol. Mass.351.4056
SMILESCC(Nc1cnc(C(N)=O)c(Nc2cc(C)cc(C)n2)c1)c1ncc[nH]1