Reaction Details
TargetTyrosine-protein kinase SYK
LigandBDBM50075943
Substrate/Competitorn/a
Meas. Tech.ChEMBL_1473534 (CHEMBL3420413)
IC50 2.0±n/a nM
Citation Ellis, JMAltman, MDBass, AButcher, JWByford, AJDonofrio, AGalloway, SHaidle, AMJewell, JKelly, NLeccese, EKLee, SMaddess, MMiller, JRMoy, LYOsimboni, EOtte, RDReddy, MVSpencer, KSun, BVincent, SHWard, GJWoo, GHYang, CHoushyar, HNorthrup, AB Overcoming mutagenicity and ion channel activity: optimization of selective spleen tyrosine kinase inhibitors. J Med Chem58:1929-39 (2015) 
 
Tyrosine-protein kinase SYK
Name:Tyrosine-protein kinase SYK
Type:Enzyme
Mol. Mass.:72079.99
Organism:Homo sapiens (Human)
Description:P43405
Residue:635
BDBM50075943
NameBDBM50075943
Synonyms:CHEMBL3415607
TypeSmall organic molecule
Emp. Form.C19H26N6O3S
Mol. Mass.418.513
SMILESCC(C)c1cccc(Nc2cc(N[C@@H]3CS(=O)(=O)CC[C@@H]3N)cnc2C(N)=O)n1