Reaction Details
TargetPotassium voltage-gated channel subfamily H member 2
LigandBDBM50075743
Substrate/Competitorn/a
Meas. Tech.ChEMBL_1473800 (CHEMBL3418525)
IC50 1700±n/a nM
Citation Ellis, JMAltman, MDBass, AButcher, JWByford, AJDonofrio, AGalloway, SHaidle, AMJewell, JKelly, NLeccese, EKLee, SMaddess, MMiller, JRMoy, LYOsimboni, EOtte, RDReddy, MVSpencer, KSun, BVincent, SHWard, GJWoo, GHYang, CHoushyar, HNorthrup, AB Overcoming mutagenicity and ion channel activity: optimization of selective spleen tyrosine kinase inhibitors. J Med Chem58:1929-39 (2015) 
 
Potassium voltage-gated channel subfamily H member 2
Name:Potassium voltage-gated channel subfamily H member 2
Type:Multi-pass membrane protein
Mol. Mass.:126672.65
Organism:Homo sapiens (Human)
Description:Q12809
Residue:1159
BDBM50075743
NameBDBM50075743
Synonyms:CHEMBL3415593
TypeSmall organic molecule
Emp. Form.C19H26N6O2
Mol. Mass.370.4487
SMILESCOc1cc(C)nc(Nc2cc(N[C@@H]3CCCC[C@@H]3N)cnc2C(N)=O)c1