Reaction Details
TargetTyrosine-protein kinase SYK
LigandBDBM50075732
Substrate/Competitorn/a
Meas. Tech.ChEMBL_1473535 (CHEMBL3420414)
IC50 130±n/a nM
Citation Ellis, JMAltman, MDBass, AButcher, JWByford, AJDonofrio, AGalloway, SHaidle, AMJewell, JKelly, NLeccese, EKLee, SMaddess, MMiller, JRMoy, LYOsimboni, EOtte, RDReddy, MVSpencer, KSun, BVincent, SHWard, GJWoo, GHYang, CHoushyar, HNorthrup, AB Overcoming mutagenicity and ion channel activity: optimization of selective spleen tyrosine kinase inhibitors. J Med Chem58:1929-39 (2015) 
 
Tyrosine-protein kinase SYK
Name:Tyrosine-protein kinase SYK
Type:Enzyme
Mol. Mass.:72079.99
Organism:Homo sapiens (Human)
Description:P43405
Residue:635
BDBM50075732
NameBDBM50075732
Synonyms:CHEMBL3414584 | US9775839, 2.1
TypeSmall organic molecule
Emp. Form.C19H22N6O
Mol. Mass.350.4176
SMILESN[C@H]1CCCC[C@H]1Nc1cnc(C(N)=O)c(n1)-c1cc2ccccc2[nH]1