Reaction Details
TargetSphingosine 1-phosphate receptor 1
LigandBDBM50169441
Substrate/Competitorn/a
Meas. Tech.ChEMBL_1578108 (CHEMBL3807063)
EC50 0.006000±n/a nM
Citation Dhar, TGXiao, HYXie, JLehman-McKeeman, LDWu, DRDabros, MYang, XTaylor, TLZhou, XDHeimrich, EMThomas, RMcIntyre, KWWarrack, BShi, HLevesque, PCZhu, JLHennan, JBalimane, PYang, ZMarino, AMCornelius, GD'Arienzo, CJMathur, AShen, DRCvijic, MESalter-Cid, LBarrish, JCCarter, PHDyckman, AJ Identification and Preclinical Pharmacology of BMS-986104: A Differentiated S1P1 Receptor Modulator in Clinical Trials. ACS Med Chem Lett7:283-8 (2016) 
 
Sphingosine 1-phosphate receptor 1
Name:Sphingosine 1-phosphate receptor 1
Type:Enzyme
Mol. Mass.:42836.02
Organism:Homo sapiens (Human)
Description:P21453
Residue:382
BDBM50169441
NameBDBM50169441
Synonyms:CHEMBL3806205
TypeSmall organic molecule
Emp. Form.C22H36NO4P
Mol. Mass.409.4993
SMILESCCCCCC[C@@H]1CCc2cc(ccc2C1)[C@H]1CC[C@](N)(COP(O)(O)=O)C1