Reaction Details
TargetSphingosine 1-phosphate receptor 3
LigandBDBM50169441
Substrate/Competitorn/a
Meas. Tech.ChEMBL_1578113 (CHEMBL3807068)
EC50>1000±n/a nM
Citation Dhar, TGXiao, HYXie, JLehman-McKeeman, LDWu, DRDabros, MYang, XTaylor, TLZhou, XDHeimrich, EMThomas, RMcIntyre, KWWarrack, BShi, HLevesque, PCZhu, JLHennan, JBalimane, PYang, ZMarino, AMCornelius, GD'Arienzo, CJMathur, AShen, DRCvijic, MESalter-Cid, LBarrish, JCCarter, PHDyckman, AJ Identification and Preclinical Pharmacology of BMS-986104: A Differentiated S1P1 Receptor Modulator in Clinical Trials. ACS Med Chem Lett7:283-8 (2016) 
 
Sphingosine 1-phosphate receptor 3
Name:Sphingosine 1-phosphate receptor 3
Type:G Protein-Coupled Receptor (GPCR)
Mol. Mass.:42278.13
Organism:Homo sapiens (Human)
Description:Q99500
Residue:378
BDBM50169441
NameBDBM50169441
Synonyms:CHEMBL3806205
TypeSmall organic molecule
Emp. Form.C22H36NO4P
Mol. Mass.409.4993
SMILESCCCCCC[C@@H]1CCc2cc(ccc2C1)[C@H]1CC[C@](N)(COP(O)(O)=O)C1