Reaction Details
TargetCyclin-dependent kinase 4
LigandBDBM107752
Substrate/Competitorn/a
Meas. Tech.Enzymatic Activity Assay
pH7.5±0
IC50 33±n/a nM
Citation Howard, SMortenson, PNHiscock, SDWoolford, AJWoodhead, AJChessari, GO'Reilly, MCongreve, MSDagostin, CCho, YSYang, FChen, CHBrain, CTLagu, BWang, YKim, SGiraldes, JLuzzio, MJPerez, LB Imidazole derivatives and their use as modulators of cyclin dependent kinases US Patent US8598217 Publication Date 12/3/2013
 
Cyclin-dependent kinase 4
Name:Cyclin-dependent kinase 4
Synonyms:Cyclin-dependent kinase 4 (CDK4)
Type:Enzyme
Mol. Mass.:21063.86
Organism:Oryctolagus cuniculus (Rabbit)
Description:Q0GMK6
Residue:189
BDBM107752
NameBDBM107752
Synonyms:US8598217, 98
TypeSmall organic molecule
Emp. Form.C25H20N4O4
Mol. Mass.440.4507
SMILESOCC(O)COc1ccc2nc([nH]c2c1)C(=O)c1ccnc(c1)-c1cncc2ccccc12