Reaction Details
TargetCyclin-dependent kinase 4
LigandBDBM50420304
Substrate/Competitorn/a
Meas. Tech.Enzymatic Activity Assay
pH7.5±0
IC50 3±n/a nM
Citation Howard, SMortenson, PNHiscock, SDWoolford, AJWoodhead, AJChessari, GO'Reilly, MCongreve, MSDagostin, CCho, YSYang, FChen, CHBrain, CTLagu, BWang, YKim, SGiraldes, JLuzzio, MJPerez, LB Imidazole derivatives and their use as modulators of cyclin dependent kinases US Patent US8598217 Publication Date 12/3/2013
 
Cyclin-dependent kinase 4
Name:Cyclin-dependent kinase 4
Synonyms:Cyclin-dependent kinase 4 (CDK4)
Type:Enzyme
Mol. Mass.:21063.86
Organism:Oryctolagus cuniculus (Rabbit)
Description:Q0GMK6
Residue:189
BDBM50420304
NameBDBM50420304
TypeSmall organic molecule
Emp. Form.C30H27N7O
Mol. Mass.501.5817
SMILESCN(C)C1CCN(CC1)c1ccc2[nH]c(nc2n1)C(=O)c1ccc(C#N)c(c1)-c1cncc2ccccc12