Reaction Details
TargetCyclin-dependent kinase 4
LigandBDBM107763
Substrate/Competitorn/a
Meas. Tech.Enzymatic Activity Assay
pH7.5±0
IC50 95±n/a nM
Citation Howard, SMortenson, PNHiscock, SDWoolford, AJWoodhead, AJChessari, GO'Reilly, MCongreve, MSDagostin, CCho, YSYang, FChen, CHBrain, CTLagu, BWang, YKim, SGiraldes, JLuzzio, MJPerez, LB Imidazole derivatives and their use as modulators of cyclin dependent kinases US Patent US8598217 Publication Date 12/3/2013
 
Cyclin-dependent kinase 4
Name:Cyclin-dependent kinase 4
Synonyms:Cyclin-dependent kinase 4 (CDK4)
Type:Enzyme
Mol. Mass.:21063.86
Organism:Oryctolagus cuniculus (Rabbit)
Description:Q0GMK6
Residue:189
BDBM107763
NameBDBM107763
Synonyms:US8598217, 189
TypeSmall organic molecule
Emp. Form.C24H24N8O
Mol. Mass.440.5004
SMILESCc1nn(C)c(C)c1-c1cc(ccc1C#N)C(=O)c1nc2nc(ccc2[nH]1)N1CCNCC1