Reaction Details
TargetPhosphatidylinositol 4,5-bisphosphate 3-kinase catalytic subunit gamma isoform
LigandBDBM50403068
Substrate/Competitorn/a
Meas. Tech.ChEMBL_1666850 (CHEMBL4016646)
IC50 63±n/a nM
Citation Liu, QShi, QMarcoux, DBatt, DGCornelius, LQin, LYRuan, ZNeels, JBeaudoin-Bertrand, MSrivastava, ASLi, LCherney, RJGong, HWatterson, SHWeigelt, CGillooly, KMMcIntyre, KWXie, JHObermeier, MTFura, ASleczka, BStefanski, KFancher, RMPadmanabhan, SRp, TKundu, IRajareddy, KSmith, RHennan, JKXing, DFan, JLevesque, PCRuan, QPitt, SZhang, RPedicord, DPan, JYarde, MLu, HLippy, JGoldstine, CSkala, SRampulla, RAMathur, AGupta, AArunachalam, PNSack, JSMuckelbauer, JKCvijic, MESalter-Cid, LMBhide, RSPoss, MAHynes, JCarter, PHMacor, JERuepp, SSchieven, GLTino, JA Identification of a Potent, Selective, and Efficacious Phosphatidylinositol 3-Kinase? (PI3K?) Inhibitor for the Treatment of Immunological Disorders. J Med Chem60:5193-5208 (2017) 
 
Phosphatidylinositol 4,5-bisphosphate 3-kinase catalytic subunit gamma isoform
Name:Phosphatidylinositol 4,5-bisphosphate 3-kinase catalytic subunit gamma isoform
Type:Enzyme Subunit
Mol. Mass.:126470.30
Organism:Homo sapiens (Human)
Description:P48736
Residue:1102
BDBM50403068
NameBDBM50403068
Synonyms:CHEMBL2216870 US9745321, CAL-101
TypeSmall organic molecule
Emp. Form.C22H18FN7O
Mol. Mass.415.423
SMILESCC[C@H](Nc1ncnc2nc[nH]c12)c1nc2cccc(F)c2c(=O)n1-c1ccccc1