Reaction Details
TargetCytochrome P450 1A2
LigandBDBM50239717
Substrate/Competitorn/a
Meas. Tech.ChEMBL_1666751 (CHEMBL4016547)
IC50>20000±n/a nM
Citation Liu, QShi, QMarcoux, DBatt, DGCornelius, LQin, LYRuan, ZNeels, JBeaudoin-Bertrand, MSrivastava, ASLi, LCherney, RJGong, HWatterson, SHWeigelt, CGillooly, KMMcIntyre, KWXie, JHObermeier, MTFura, ASleczka, BStefanski, KFancher, RMPadmanabhan, SRp, TKundu, IRajareddy, KSmith, RHennan, JKXing, DFan, JLevesque, PCRuan, QPitt, SZhang, RPedicord, DPan, JYarde, MLu, HLippy, JGoldstine, CSkala, SRampulla, RAMathur, AGupta, AArunachalam, PNSack, JSMuckelbauer, JKCvijic, MESalter-Cid, LMBhide, RSPoss, MAHynes, JCarter, PHMacor, JERuepp, SSchieven, GLTino, JA Identification of a Potent, Selective, and Efficacious Phosphatidylinositol 3-Kinase? (PI3K?) Inhibitor for the Treatment of Immunological Disorders. J Med Chem60:5193-5208 (2017) 
 
Cytochrome P450 1A2
Name:Cytochrome P450 1A2
Type:Enzyme
Mol. Mass.:58423.38
Organism:Homo sapiens (Human)
Description:P05177
Residue:516
BDBM50239717
NameBDBM50239717
Synonyms:CHEMBL4059848 | US10214537, Example 657
TypeSmall organic molecule
Emp. Form.C25H25F3N8O2
Mol. Mass.526.5136
SMILESCC(=O)N1CCN(C(=O)C1(C)C)c1cccc(c1)-c1cc(-c2ccnn2CC(F)(F)F)c2c(N)ncnn12