Reaction Details
TargetHexokinase-4
LigandBDBM50585812
Substrate/Competitorn/a
Meas. Tech.ChEMBL_2164068 (CHEMBL5048929)
EC50 42±n/a nM
Citation Shi, YWang, YMeng, WBrigance, RPRyono, DEBolton, SZhang, HChen, SSmirk, RTao, STino, JAWilliams, KNSulsky, RNielsen, LEllsworth, BWong, MKYSun, JHLeith, LWSun, DWu, DRGupta, ARampulla, RMathur, AChen, BCWang, AFuentes-Catanio, HGKunselman, LCap, MZalaznick, JMa, XLiu, HTaylor, JRZebo, RJones, BKalinowski, SSwartz, JStaal, AO'Malley, KKopcho, LMuckelbauer, JKKrystek, SRSpronk, SAMarcinkeviciene, JEverlof, GChen, XQXu, CLi, YXLangish, RAYang, YWang, QBehnia, KFura, AJanovitz, EBPannacciulli, NGriffen, SZinker, BAKrupinski, JKirby, MWhaley, JZahler, RBarrish, JCRobl, JACheng, PTW Discovery of a Partial Glucokinase Activator Clinical Candidate: Diethyl ((3-(3-((5-(Azetidine-1-carbonyl)pyrazin-2-yl)oxy)-5-isopropoxybenzamido)-1 J Med Chem65:4291-4317 (2022) 
 
Hexokinase-4
Name:Hexokinase-4
Type:Enzyme
Mol. Mass.:52075.40
Organism:Mus musculus (Mouse)
Description:P52792
Residue:465
BDBM50585812
NameBDBM50585812
Synonyms:CHEMBL5091943
TypeSmall organic molecule
Emp. Form.C26H33N2O9PS2
Mol. Mass.612.652
SMILESCCOP(=O)(Cc1csc(NC(=O)c2cc(O[C@@H](C)COC)cc(Oc3ccc(cc3)S(C)(=O)=O)c2)n1)OCC