Reaction Details
TargetCasein kinase I isoform alpha/delta/epsilon/gamma-1/gamma-2
LigandBDBM50179207
Substrate/Competitorn/a
Meas. Tech.ChEMBL_325239 (CHEMBL861600)
IC50 7200±n/a nM
Citation Ho, CYLudovici, DWMaharoof, USMei, JSechler, JLTuman, RWStrobel, EDAndraka, LYen, HKLeo, GLi, JAlmond, HLu, HDeVine, ATominovich, RMBaker, JEmanuel, SGruninger, RHMiddleton, SAJohnson, DLGalemmo, RA (6,7-Dimethoxy-2,4-dihydroindeno[1,2-c]pyrazol-3-yl)phenylamines: platelet-derived growth factor receptor tyrosine kinase inhibitors with broad antiproliferative activity against tumor cells. J Med Chem48:8163-73 (2005) 
 
Casein kinase I isoform alpha/delta/epsilon/gamma-1/gamma-2
Name:Casein kinase I isoform alpha/delta/epsilon/gamma-1/gamma-2
Synonyms:Casein kinase I
Type:n/a
Mol. Mass.:n/a
Description:ASSAY_ID of ChEMBL is 304706
Components:This complex has 5 components.
Component 1
Name:Casein kinase I isoform gamma-1
Type:PROTEIN
Mol. Mass.:48530.93
Organism:Homo sapiens (Human)
Description:ChEMBL_774608
Residue:422
Component 2
Name:Casein kinase I isoform delta
Synonyms:CKI-delta CSNK1D Casein kinase I delta Casein kinase I isoform delta (CK1D) KC1D_HUMAN | casein kinases 1 delta (CK1 delta)
Type:Enzyme
Mol. Mass.:47356.76
Organism:Homo sapiens (Human)
Description:P48730
Residue:415
Component 3
Name:Casein kinase I isoform epsilon
Synonyms:Axin-1/Casein kinase I epsilon CKIe Casein kinase 1 epsilon (CK1Ɛ) Casein kinase I isoform epsilon (CK1 epsilon) Casein kinase I isoform epsilon (CK1epsilon) | KC1E_HUMAN
Type:Protein
Mol. Mass.:47340.25
Organism:Homo sapiens (Human)
Description:P49674
Residue:416
Component 4
Name:Casein kinase I isoform gamma-2
Synonyms:CK1G2 Casein kinase I KC1G2_HUMAN
Type:PROTEIN
Mol. Mass.:47475.36
Organism:Homo sapiens (Human)
Description:ChEMBL_774313
Residue:415
Component 5
Name:Casein kinase I isoform alpha
Synonyms:CK1 CSNK1A1 Casein kinase 1 alpha (CK1 alpha) KC1A_HUMAN
Type:Serine/threonine-protein kinase
Mol. Mass.:38936.59
Organism:Homo sapiens (Human)
Description:P48729
Residue:337
BDBM50179207
NameBDBM50179207
Synonyms:3-fluoro-N-(6,7-dimethoxy-2,4-dihydroindeno[1,2-c]pyrazol-3-yl)phenylamine JNJ-10198409
TypeSmall organic molecule
Emp. Form.C18H16FN3O2
Mol. Mass.325.3369
SMILESCOc1cc2Cc3c(Nc4cccc(F)c4)[nH]nc3-c2cc1OC