Reaction Details
TargetTyrosine-protein kinase Lck
LigandBDBM50179207
Substrate/Competitorn/a
Meas. Tech.ChEMBL_325232 (CHEMBL861593)
IC50 100±n/a nM
Citation Ho, CYLudovici, DWMaharoof, USMei, JSechler, JLTuman, RWStrobel, EDAndraka, LYen, HKLeo, GLi, JAlmond, HLu, HDeVine, ATominovich, RMBaker, JEmanuel, SGruninger, RHMiddleton, SAJohnson, DLGalemmo, RA (6,7-Dimethoxy-2,4-dihydroindeno[1,2-c]pyrazol-3-yl)phenylamines: platelet-derived growth factor receptor tyrosine kinase inhibitors with broad antiproliferative activity against tumor cells. J Med Chem48:8163-73 (2005) 
 
Tyrosine-protein kinase Lck
Name:Tyrosine-protein kinase Lck
Type:n/a
Mol. Mass.:57987.83
Organism:Homo sapiens (Human)
Description:P06239
Residue:509
BDBM50179207
NameBDBM50179207
Synonyms:3-fluoro-N-(6,7-dimethoxy-2,4-dihydroindeno[1,2-c]pyrazol-3-yl)phenylamine JNJ-10198409
TypeSmall organic molecule
Emp. Form.C18H16FN3O2
Mol. Mass.325.3369
SMILESCOc1cc2Cc3c(Nc4cccc(F)c4)[nH]nc3-c2cc1OC