Reaction Details
TargetIndoleamine 2,3-dioxygenase 1
LigandBDBM50538503
Substrate/Competitorn/a
Meas. Tech.ChEMBL_2246302 (CHEMBL5160512)
IC50 0.090000±n/a nM
Citation Li, DSloman, DLAchab, AZhou, HMcGowan, MAWhite, CGibeau, CZhang, HPu, QBharathan, IHopkins, BLiu, KFerguson, HFradera, XLesburg, CAMartinot, TAQi, JSong, ZJYin, JZhang, HSong, LWan, BDAddio, SSolban, NMiller, JRZamlynny, BBass, AFreeland, EYkoruk, BHilliard, CFerraro, JZhai, JKnemeyer, IOtte, KMVincent, SSciammetta, NPasternak, ABennett, DJHan, Y Oxetane Promise Delivered: Discovery of Long-Acting IDO1 Inhibitors Suitable for Q3W Oral or Parenteral Dosing. J Med Chem65:6001-6016 (2022) 
 
Indoleamine 2,3-dioxygenase 1
Name:Indoleamine 2,3-dioxygenase 1
Type:Enzyme
Mol. Mass.:45330.80
Organism:Homo sapiens (Human)
Description:P14902
Residue:403
BDBM50538503
NameBDBM50538503
Synonyms:CHEMBL4645108
TypeSmall organic molecule
Emp. Form.C23H18ClFN2O3
Mol. Mass.424.852
SMILESFc1ccc(NC(=O)C2(COC2)c2ccc(NC(=O)c3cccc(Cl)c3)cc2)cc1