Reaction Details
TargetProstaglandin E2 receptor EP3 subtype
LigandBDBM50384446
Substrate/Competitorn/a
Meas. Tech.ChEMBL_821762 (CHEMBL2039059)
Ki 19.95±n/a nM
Citation Jin, JMorales-Ramos, AEidam, PMecom, JLi, YBrooks, CHilfiker, MZhang, DWang, NShi, DTseng, PSWheless, KBudzik, BEvans, KJaworski, JPJugus, JLeon, LWu, CPullen, MKaramshi, BRao, PWard, ELaping, NEvans, CLeach, CHolt, DSu, XMorrow, DFries, HThorneloe, KEdwards, R Novel 3-Oxazolidinedione-6-aryl-pyridinones as Potent, Selective, and Orally Active EP3 Receptor Antagonists. ACS Med Chem Lett1:316-320 (2010) 
 
Prostaglandin E2 receptor EP3 subtype
Name:Prostaglandin E2 receptor EP3 subtype
Type:Enzyme
Mol. Mass.:43335.03
Organism:Homo sapiens (Human)
Description:P43115
Residue:390
BDBM50384446
NameBDBM50384446
Synonyms:CHEMBL2035509
TypeSmall organic molecule
Emp. Form.C19H20N2O4
Mol. Mass.340.3731
SMILESCC(C)C1(OC(=O)NC1=O)c1ccc([nH]c1=O)-c1ccc(C)c(C)c1