Reaction Details
TargetHistone deacetylase 1
LigandBDBM50334366
Substrate/Competitorn/a
Meas. Tech.ChEMBL_874011 (CHEMBL2186136)
IC50 60±n/a nM
Citation Wong, JCTang, GWu, XLiang, CZhang, ZGuo, LPeng, ZZhang, WLin, XWang, ZMei, JChen, JPan, SZhang, NLiu, YZhou, MFeng, LZhao, WLi, SZhang, CZhang, MRong, YJin, TGZhang, XRen, SJi, YZhao, RShe, JRen, YXu, CChen, DCai, JShan, SPan, DNing, ZLu, XChen, THe, YChen, L Pharmacokinetic optimization of class-selective histone deacetylase inhibitors and identification of associated candidate predictive biomarkers of hepatocellular carcinoma tumor response. J Med Chem55:8903-25 (2012) 
 
Histone deacetylase 1
Name:Histone deacetylase 1
Type:Enzyme
Mol. Mass.:55090.27
Organism:Homo sapiens (Human)
Description:Q13547
Residue:482
BDBM50334366
NameBDBM50334366
Synonyms:CHEMBL1643308 | N-(2-aminophenyl)-3-(4-(1-(2-morpholinoethylamino)-2-oxo-2-(4-(trifluoromethyl)phenylamino)ethyl)phenyl)acrylamide
TypeSmall organic molecule
Emp. Form.C30H32F3N5O3
Mol. Mass.567.602
SMILESNc1ccccc1NC(=O)\C=C\c1ccc(cc1)C(NCCN1CCOCC1)C(=O)Nc1ccc(cc1)C(F)(F)F