Reaction Details
TargetCytochrome P450 2C9
LigandBDBM50399008
Substrate/Competitorn/a
Meas. Tech.ChEMBL_876025 (CHEMBL2182316)
IC50 4000±n/a nM
Citation Wong, JCTang, GWu, XLiang, CZhang, ZGuo, LPeng, ZZhang, WLin, XWang, ZMei, JChen, JPan, SZhang, NLiu, YZhou, MFeng, LZhao, WLi, SZhang, CZhang, MRong, YJin, TGZhang, XRen, SJi, YZhao, RShe, JRen, YXu, CChen, DCai, JShan, SPan, DNing, ZLu, XChen, THe, YChen, L Pharmacokinetic optimization of class-selective histone deacetylase inhibitors and identification of associated candidate predictive biomarkers of hepatocellular carcinoma tumor response. J Med Chem55:8903-25 (2012) 
 
Cytochrome P450 2C9
Name:Cytochrome P450 2C9
Type:Enzyme
Mol. Mass.:55636.33
Organism:Homo sapiens (Human)
Description:P11712
Residue:490
BDBM50399008
NameBDBM50399008
Synonyms:CHEMBL2178223
TypeSmall organic molecule
Emp. Form.C30H33ClN4O3
Mol. Mass.533.061
SMILESCC(C)(O)CN1C[C@@H]([C@H](C1)c1ccc(\C=C\C(=O)Nc2ccccc2N)cc1)C(=O)Nc1ccc(Cl)cc1