Reaction Details
TargetCytochrome P450 3A4
LigandBDBM50399007
Substrate/Competitorn/a
Meas. Tech.ChEMBL_876026 (CHEMBL2182317)
IC50 2000±n/a nM
Citation Wong, JCTang, GWu, XLiang, CZhang, ZGuo, LPeng, ZZhang, WLin, XWang, ZMei, JChen, JPan, SZhang, NLiu, YZhou, MFeng, LZhao, WLi, SZhang, CZhang, MRong, YJin, TGZhang, XRen, SJi, YZhao, RShe, JRen, YXu, CChen, DCai, JShan, SPan, DNing, ZLu, XChen, THe, YChen, L Pharmacokinetic optimization of class-selective histone deacetylase inhibitors and identification of associated candidate predictive biomarkers of hepatocellular carcinoma tumor response. J Med Chem55:8903-25 (2012) 
 
Cytochrome P450 3A4
Name:Cytochrome P450 3A4
Type:Enzyme
Mol. Mass.:57349.57
Organism:Homo sapiens (Human)
Description:n/a
Residue:503
BDBM50399007
NameBDBM50399007
Synonyms:CHEMBL2178221
TypeSmall organic molecule
Emp. Form.C28H29ClN4O3
Mol. Mass.505.008
SMILESNc1ccccc1NC(=O)\C=C\c1ccc(cc1)[C@H]1CN(CCO)C[C@@H]1C(=O)Nc1ccc(Cl)cc1