Reaction Details
TargetHistone deacetylase 9
LigandBDBM50399004
Substrate/Competitorn/a
Meas. Tech.ChEMBL_876030 (CHEMBL2182321)
IC50 43000±n/a nM
Citation Wong, JCTang, GWu, XLiang, CZhang, ZGuo, LPeng, ZZhang, WLin, XWang, ZMei, JChen, JPan, SZhang, NLiu, YZhou, MFeng, LZhao, WLi, SZhang, CZhang, MRong, YJin, TGZhang, XRen, SJi, YZhao, RShe, JRen, YXu, CChen, DCai, JShan, SPan, DNing, ZLu, XChen, THe, YChen, L Pharmacokinetic optimization of class-selective histone deacetylase inhibitors and identification of associated candidate predictive biomarkers of hepatocellular carcinoma tumor response. J Med Chem55:8903-25 (2012) 
 
Histone deacetylase 9
Name:Histone deacetylase 9
Type:Enzyme
Mol. Mass.:111304.31
Organism:Homo sapiens (Human)
Description:Q9UKV0
Residue:1011
BDBM50399004
NameBDBM50399004
Synonyms:CHEMBL2177582
TypeSmall organic molecule
Emp. Form.C27H26ClFN4O2
Mol. Mass.492.972
SMILESCN1C[C@@H]([C@H](C1)c1ccc(\C=C\C(=O)Nc2ccccc2N)cc1F)C(=O)Nc1ccc(Cl)cc1